Witaj na Forum Linuxiarzy
Zanim zalogujesz się, by pisać na naszym forum, zapoznaj się z kilkoma zasadami savoir-vivre'u w wątku Administracja.
Wątki z problemami zamieszczone w dziale "Przywitaj się" oraz wszelkie reklamy na naszym forum będą usuwane.

Autor Wątek: Problem Pyrit Kali Linx  (Przeczytany 111 razy)

Offline Maniek11

  • Newbie
  • *
  • Wiadomości: 8
  • Reputacja: +0/-0
Problem Pyrit Kali Linx
« dnia: Październik 07, 2020, 10:57:17 am »
Witam wszystkich.
Dwa dni walcze z takim prolemem i nie moge sie uporac
Pomoze ktos go rozwiazac ?
Z gory dzieki


root1@DESKTOP-UJAHLV8:~/Pyrit$ sudo python setup.py build
running build
running build_py
running build_ext
building 'cpyrit._cpyrit_cpu' extension
creating build/temp.linux-x86_64-2.7
creating build/temp.linux-x86_64-2.7/cpyrit
x86_64-linux-gnu-gcc -pthread -fno-strict-aliasing -Wdate-time -D_FORTIFY_SOURCE=2 -g -fdebug-prefix-map=/build/python2.7-uC7NI8/python2.7-2.7.18=. -fstack-protector-strong -Wformat -Werror=format-security -fPIC -I/usr/include/python2.7 -c cpyrit/_cpyrit_cpu.c -o build/temp.linux-x86_64-2.7/cpyrit/_cpyrit_cpu.o -Wall -fno-strict-aliasing -DVERSION="0.5.1" -maes -mpclmul
cpyrit/_cpyrit_cpu.c:40:10: fatal error: pcap.h: Nie ma takiego pliku ani katalogu
   40 | #include <pcap.h>
      |          ^~~~~~~~
compilation terminated.
Failed to build; Compiling without AES-NI
building 'cpyrit._cpyrit_cpu' extension
x86_64-linux-gnu-gcc -pthread -fno-strict-aliasing -Wdate-time -D_FORTIFY_SOURCE=2 -g -fdebug-prefix-map=/build/python2.7-uC7NI8/python2.7-2.7.18=. -fstack-protector-strong -Wformat -Werror=format-security -fPIC -I/usr/include/python2.7 -c cpyrit/_cpyrit_cpu.c -o build/temp.linux-x86_64-2.7/cpyrit/_cpyrit_cpu.o -Wall -fno-strict-aliasing -DVERSION="0.5.1"
cpyrit/_cpyrit_cpu.c:40:10: fatal error: pcap.h: Nie ma takiego pliku ani katalogu
   40 | #include <pcap.h>
      |          ^~~~~~~~
compilation terminated.
error: command 'x86_64-linux-gnu-gcc' failed with exit status 1
« Ostatnia zmiana: Październik 07, 2020, 11:18:45 am wysłana przez lami07 »

Offline arecki

  • Full Member
  • ***
  • Wiadomości: 164
  • Reputacja: +0/-0
Odp: Problem Pyrit Kali Linx
« Odpowiedź #1 dnia: Październik 07, 2020, 11:38:10 am »
Doinstaluj paczkę libpcap-dev
Debian testing.

Offline Maniek11

  • Newbie
  • *
  • Wiadomości: 8
  • Reputacja: +0/-0
Odp: Problem Pyrit Kali Linx
« Odpowiedź #2 dnia: Październik 07, 2020, 11:44:07 am »
nie pomaga

sudo apt-get install libcap-dev

sudo apt-get install python2.7-dev libssl-dev zlib1g-dev libcap-dev




Offline arecki

  • Full Member
  • ***
  • Wiadomości: 164
  • Reputacja: +0/-0
Odp: Problem Pyrit Kali Linx
« Odpowiedź #3 dnia: Październik 07, 2020, 11:50:55 am »
No ale wklej jakies logi z instalacji.
Pozatym python 2 juz dawno poszedl w odstawke, teraz sa czasy python 3.
« Ostatnia zmiana: Październik 07, 2020, 11:52:32 am wysłana przez arecki »
Debian testing.

Offline Maniek11

  • Newbie
  • *
  • Wiadomości: 8
  • Reputacja: +0/-0
Odp: Problem Pyrit Kali Linx
« Odpowiedź #4 dnia: Październik 07, 2020, 12:13:41 pm »
root1@DESKTOP-UJAHLV8:~$ sudo apt-get install libcap-dev
Czytanie list pakietów... Gotowe
Budowanie drzewa zależności       
Odczyt informacji o stanie... Gotowe
libcap-dev is already the newest version (1:2.43-1).
0 aktualizowanych, 0 nowo instalowanych, 0 usuwanych i 86 nieaktualizowanych.
root1@DESKTOP-UJAHLV8:~$ sudo apt-get install python2.7-dev libssl-dev zlib1g-dev libcap-dev
Czytanie list pakietów... Gotowe
Budowanie drzewa zależności       
Odczyt informacji o stanie... Gotowe
libcap-dev is already the newest version (1:2.43-1).
libssl-dev is already the newest version (1.1.1g-1).
python2.7-dev is already the newest version (2.7.18-1).
zlib1g-dev is already the newest version (1:1.2.11.dfsg-2).
0 aktualizowanych, 0 nowo instalowanych, 0 usuwanych i 86 nieaktualizowanych.
root1@DESKTOP-UJAHLV8:~$ cd Pyrit
root1@DESKTOP-UJAHLV8:~/Pyrit$ sudo python setup.py clean
running clean
root1@DESKTOP-UJAHLV8:~/Pyrit$ sudo python setup.py build
running build
running build_py
running build_ext
building 'cpyrit._cpyrit_cpu' extension
creating build/temp.linux-x86_64-2.7
creating build/temp.linux-x86_64-2.7/cpyrit
x86_64-linux-gnu-gcc -pthread -fno-strict-aliasing -Wdate-time -D_FORTIFY_SOURCE=2 -g -fdebug-prefix-map=/build/python2.7-uC7NI8/python2.7-2.7.18=. -fstack-protector-strong -Wformat -Werror=format-security -fPIC -I/usr/include/python2.7 -c cpyrit/_cpyrit_cpu.c -o build/temp.linux-x86_64-2.7/cpyrit/_cpyrit_cpu.o -Wall -fno-strict-aliasing -DVERSION="0.5.1" -maes -mpclmul
cpyrit/_cpyrit_cpu.c:40:10: fatal error: pcap.h: Nie ma takiego pliku ani katalogu
   40 | #include <pcap.h>
      |          ^~~~~~~~
compilation terminated.
Failed to build; Compiling without AES-NI
building 'cpyrit._cpyrit_cpu' extension
x86_64-linux-gnu-gcc -pthread -fno-strict-aliasing -Wdate-time -D_FORTIFY_SOURCE=2 -g -fdebug-prefix-map=/build/python2.7-uC7NI8/python2.7-2.7.18=. -fstack-protector-strong -Wformat -Werror=format-security -fPIC -I/usr/include/python2.7 -c cpyrit/_cpyrit_cpu.c -o build/temp.linux-x86_64-2.7/cpyrit/_cpyrit_cpu.o -Wall -fno-strict-aliasing -DVERSION="0.5.1"
cpyrit/_cpyrit_cpu.c:40:10: fatal error: pcap.h: Nie ma takiego pliku ani katalogu
   40 | #include <pcap.h>
      |          ^~~~~~~~
compilation terminated.
error: command 'x86_64-linux-gnu-gcc' failed with exit status 1
root1@DESKTOP-UJAHLV8:~/Pyrit$ sudo python setup.py install
running install
running build
running build_py
running build_ext
building 'cpyrit._cpyrit_cpu' extension
x86_64-linux-gnu-gcc -pthread -fno-strict-aliasing -Wdate-time -D_FORTIFY_SOURCE=2 -g -fdebug-prefix-map=/build/python2.7-uC7NI8/python2.7-2.7.18=. -fstack-protector-strong -Wformat -Werror=format-security -fPIC -I/usr/include/python2.7 -c cpyrit/_cpyrit_cpu.c -o build/temp.linux-x86_64-2.7/cpyrit/_cpyrit_cpu.o -Wall -fno-strict-aliasing -DVERSION="0.5.1" -maes -mpclmul
cpyrit/_cpyrit_cpu.c:40:10: fatal error: pcap.h: Nie ma takiego pliku ani katalogu
   40 | #include <pcap.h>
      |          ^~~~~~~~
compilation terminated.
Failed to build; Compiling without AES-NI
building 'cpyrit._cpyrit_cpu' extension
x86_64-linux-gnu-gcc -pthread -fno-strict-aliasing -Wdate-time -D_FORTIFY_SOURCE=2 -g -fdebug-prefix-map=/build/python2.7-uC7NI8/python2.7-2.7.18=. -fstack-protector-strong -Wformat -Werror=format-security -fPIC -I/usr/include/python2.7 -c cpyrit/_cpyrit_cpu.c -o build/temp.linux-x86_64-2.7/cpyrit/_cpyrit_cpu.o -Wall -fno-strict-aliasing -DVERSION="0.5.1"
cpyrit/_cpyrit_cpu.c:40:10: fatal error: pcap.h: Nie ma takiego pliku ani katalogu
   40 | #include <pcap.h>
      |          ^~~~~~~~
compilation terminated.
error: command 'x86_64-linux-gnu-gcc' failed with exit status 1
root1@DESKTOP-UJAHLV8:~/Pyrit$

Online pavbaranov

  • Hero Member
  • *****
  • Wiadomości: 2551
  • Reputacja: +35/-8
Odp: Problem Pyrit Kali Linx
« Odpowiedź #5 dnia: Październik 07, 2020, 01:05:34 pm »
Brakuje Ci pliku pcap.h. Aby zbudować musisz dostarczyć paczkę, która zawiera ten plik.

Offline arecki

  • Full Member
  • ***
  • Wiadomości: 164
  • Reputacja: +0/-0
Odp: Problem Pyrit Kali Linx
« Odpowiedź #6 dnia: Październik 07, 2020, 01:07:25 pm »
Miałeś zainstalować libpcap-dev, a instalujesz libcap-dev.
Debian testing.

Offline Maniek11

  • Newbie
  • *
  • Wiadomości: 8
  • Reputacja: +0/-0
Odp: Problem Pyrit Kali Linx
« Odpowiedź #7 dnia: Październik 07, 2020, 06:50:35 pm »
Wielkie dzieki za pomoc
wszystko ok.
Pozdrawiam